Target
Prostaglandin E2 receptor EP4 subtype
Ligand
BDBM50308126
Substrate
Meas. Tech.
Binding Assay
pH
6±n/a
Temperature
298.15±n/a K
Ki
3.1±n/a nM
Comments
extracted
Citation
 Blouin, MBurch, JHan, YMellon, C Thiophenecarboxamide derivatives as EP4 receptor ligands US Patent  US8969394 Publication Date 3/3/2015 
Target
Name:
Prostaglandin E2 receptor EP4 subtype
Synonyms:
PE2R4_HUMAN PGE2 receptor EP4 subtype PTGER4 Prostanoid EP4 receptor
Type:
Enzyme
Mol. Mass.:
53134.53
Organism:
Homo sapiens (Human)
Description:
P35408
Residue:
488
  
Inhibitor
Name:
BDBM50308126
Synonyms:
4-[(1S)-1-({[4-(3-Chlorobenzyl)-2,5-dimethyl-3-thienyl]carbonyl}-amino)ethyl]benzoic Acid | CHEMBL604546
Type:
Small organic molecule
Emp. Form.:
C23H22ClNO3S
Mol. Mass.:
427.944
SMILES:
C[C@H](NC(=O)c1c(C)sc(C)c1Cc1cccc(Cl)c1)c1ccc(cc1)C(O)=O
: