Target
Tyrosine-protein kinase SYK
Ligand
BDBM144534
Substrate
Meas. Tech.
Kinase Glo Luminescence Kinase Assay
IC50
0.5±n/a nM
Citation
 Hoffmann, MDahmann, GFiegen, DHandschuh, SKlicic, JLinz, GSchaenzle, GSchnapp, AEast, SPMazanetz, MPScott, RJWalker, E Substituted naphthyridines and their use as medicaments US Patent  US8969568 Publication Date 3/3/2015 
Target
Name:
Tyrosine-protein kinase SYK
Synonyms:
KSYK_HUMAN Spleen Tyrosine Kinase Tyrosine-protein kinase SYK (Syk)
Type:
Enzyme
Mol. Mass.:
72079.99
Organism:
Homo sapiens (Human)
Description:
P43405
Residue:
635
  
Inhibitor
Name:
BDBM144534
Synonyms:
US8969568, 87
Type:
Small organic molecule
Emp. Form.:
C22H23N3O4
Mol. Mass.:
393.4357
SMILES:
COc1cc(OC)cc(c1)-c1cc2ncccc2c(O[C@H](C)[C@H]2CNC(=O)C2)n1
: