Target
Tyrosine-protein kinase SYK
Ligand
BDBM50396073
Substrate
Meas. Tech.
Inhibition Assay
IC50
4±n/a nM
Citation
 Jia, ZJVenkataramani, CHuang, WMehrotra, MSong, YXu, QBauer, SMRose, JWKane, BPandey, A Inhibitors of syk and JAK protein kinases US Patent  US8952027 Publication Date 2/10/2015 
Target
Name:
Tyrosine-protein kinase SYK
Synonyms:
KSYK_HUMAN Spleen Tyrosine Kinase Tyrosine-protein kinase SYK (Syk)
Type:
Enzyme
Mol. Mass.:
72079.99
Organism:
Homo sapiens (Human)
Description:
P43405
Residue:
635
  
Inhibitor
Name:
BDBM50396073
Synonyms:
CHEMBL1235110
Type:
Small organic molecule
Emp. Form.:
C18H24N6O
Mol. Mass.:
340.4228
SMILES:
Cc1cccc(Nc2nc(N[C@@H]3CCCC[C@@H]3N)ncc2C(N)=O)c1
: