Target
Somatostatin receptor type 2
Ligand
BDBM144753
Substrate
Meas. Tech.
Radioligand Binding Assay
pH
7.6±n/a
Temperature
298.15±n/a K
Ki
0.06±n/a nM
Comments
extracted
Citation
 Dong, ZXShen, YKim, SH Somatostatin-dopamine chimeric analogs US Patent  US8952128 Publication Date 2/10/2015 
Target
Name:
Somatostatin receptor type 2
Synonyms:
SOMATOSTATIN SST2 SS-2-R SS2R SSTR2 | Somatostatin receptor type 2 (SSTR2)
Type:
Enzyme
Mol. Mass.:
41344.94
Organism:
Homo sapiens (Human)
Description:
P30874
Residue:
369
  
Inhibitor
Name:
BDBM144753
Synonyms:
US8952128, 12 | US8952128, 46
Type:
Small organic molecule
Emp. Form.:
C77H101N17O11S
Mol. Mass.:
1472.798
SMILES:
C[C@@H](O)[C@@H]1NC(=O)[C@H](CCCCN)NC(=O)[C@@H](Cc2c[nH]c3ccccc23)NC(=O)[C@H](Cc2ccncc2)NC(=O)[C@H](Cc2ccccc2)NC(=O)[C@H](CCCNC(N)=N)NC(=O)[C@@H](CCCCNC(=O)[C@H](Cc2ccc(O)cc2)NC1=O)NCC[S@@](=O)C[C@@H]1C[C@H]2[C@@H](Cc3c[nH]c4cccc2c34)N(C)C1
: