Target
Solute carrier organic anion transporter family member 2A1
Ligand
BDBM144803
Substrate
Meas. Tech.
Inhibition Assay
Temperature
298.15±n/a K
IC50
890±n/a nM
Comments
extracted
Citation
 Schuster, VLChi, YWasmuth, ASPottorf, RSOlson, GL Prostaglandin transporter inhibitors and uses thereof US Patent  US8952150 Publication Date 2/10/2015 
Target
Name:
Solute carrier organic anion transporter family member 2A1
Synonyms:
Matr1 Prostaglandin transporter (PGT) Slc21a2 Solute carrier family 21 member 2
Type:
Protein
Mol. Mass.:
70404.97
Organism:
Rattus norvegicus (Rat)
Description:
Q00910
Residue:
644
  
Inhibitor
Name:
BDBM144803
Synonyms:
US8952150, 69
Type:
Small organic molecule
Emp. Form.:
C36H37N7O6
Mol. Mass.:
663.7223
SMILES:
Oc1ccc(Nc2nc(NCCOCCOCCNC(=O)c3ccccc3)nc(Nc3ccc(cc3)C(=O)OCc3ccccc3)n2)cc1
: