Target
Sodium channel protein type 9 subunit alpha
Ligand
BDBM145616
Substrate
Meas. Tech.
Radioligand Binding Assay
pH
7.4±n/a
Temperature
298.15±n/a K
IC50
4±n/a nM
Comments
extracted
Citation
 Andrez, JChowdhury, SDecker, SMDehnhardt, CMFocken, TGrimwood, MEHemeon, IWJia, QLi, JOrtwine, DFSafina, BSheng, TSun, SSutherlin, DPWilson, MSZenova, AY N-substituted benzamides and methods of use thereof US Patent  US8952169 Publication Date 2/10/2015 
Target
Name:
Sodium channel protein type 9 subunit alpha
Synonyms:
NENA Peripheral sodium channel 1 SCN9A_HUMAN Voltage-gated sodium channel subunit Nav1.7 hNE-Na
Type:
Protein
Mol. Mass.:
226375.97
Organism:
Homo sapiens (Human)
Description:
Q15858
Residue:
1988
  
Inhibitor
Name:
BDBM145616
Synonyms:
US8952169, 419
Type:
Small organic molecule
Emp. Form.:
C21H28FNO4S
Mol. Mass.:
409.515
SMILES:
CC1(COc2cc(F)c(cc2C2CC2)C(=O)NS(C)(=O)=O)CCC2(CC2)CC1
: