Target
Sodium channel protein type 5 subunit alpha
Ligand
BDBM145307
Substrate
Meas. Tech.
Electrophysiological Assay
Temperature
310.15±n/a K
IC50
700±n/a nM
Comments
extracted
Citation
 Andrez, JChowdhury, SDecker, SMDehnhardt, CMFocken, TGrimwood, MEHemeon, IWJia, QLi, JOrtwine, DFSafina, BSheng, TSun, SSutherlin, DPWilson, MSZenova, AY N-substituted benzamides and methods of use thereof US Patent  US8952169 Publication Date 2/10/2015 
Target
Name:
Sodium channel protein type 5 subunit alpha
Synonyms:
HH1 SCN5A_HUMAN Sodium channel protein type 5 subunit alpha/beta-1/beta-2 Voltage-gated sodium channel subunit alpha Nav1.5
Type:
Enzyme
Mol. Mass.:
226908.60
Organism:
Homo sapiens (Human)
Description:
Q14524
Residue:
2016
  
Inhibitor
Name:
BDBM145307
Synonyms:
US8952169, 86 | US9771376, Example 86
Type:
Small organic molecule
Emp. Form.:
C22H29NO4S
Mol. Mass.:
403.535
SMILES:
CS(=O)(=O)NC(=O)c1ccc(OCC23CC4CC(CC(C4)C2)C3)c(c1)C1CC1
: