Target
Sodium channel protein type 5 subunit alpha
Ligand
BDBM145369
Substrate
Meas. Tech.
Electrophysiological Assay
Temperature
310.15±n/a K
IC50
26±n/a nM
Comments
extracted
Citation
 Andrez, JChowdhury, SDecker, SMDehnhardt, CMFocken, TGrimwood, MEHemeon, IWJia, QLi, JOrtwine, DFSafina, BSheng, TSun, SSutherlin, DPWilson, MSZenova, AY N-substituted benzamides and methods of use thereof US Patent  US8952169 Publication Date 2/10/2015 
Target
Name:
Sodium channel protein type 5 subunit alpha
Synonyms:
HH1 SCN5A_HUMAN Sodium channel protein type 5 subunit alpha/beta-1/beta-2 Voltage-gated sodium channel subunit alpha Nav1.5
Type:
Enzyme
Mol. Mass.:
226908.60
Organism:
Homo sapiens (Human)
Description:
Q14524
Residue:
2016
  
Inhibitor
Name:
BDBM145369
Synonyms:
US8952169, 148 | US9771376, Example 148
Type:
Small organic molecule
Emp. Form.:
C24H30FNO4S
Mol. Mass.:
447.563
SMILES:
Fc1cc(OCC23CC4CC(CC(C4)C2)C3)c(cc1C(=O)NS(=O)(=O)C1CC1)C1CC1
: