Target
Arachidonate 5-lipoxygenase-activating protein
Ligand
BDBM145796
Substrate
Meas. Tech.
Homogeneous Time Resolved Fluorescence Assay
Ki
2.4±n/a nM
Citation
 Chai, WDvorak, CAEccles, WEdwards, JPGoldberg, SDKrawczuk, PJLebsack, ADLiu, JPippel, DJSales, ZSTanis, VMTichenor, MSWiener, JJ 1,2,6-substituted benzimidazoles as FLAP modulators US Patent  US8952177 Publication Date 2/10/2015 
Target
Name:
Arachidonate 5-lipoxygenase-activating protein
Synonyms:
5-lipoxygenase-activating protein (FLAP) ALOX5AP
Type:
Protein
Mol. Mass.:
24212.61
Organism:
Homo sapiens (Human)
Description:
A0A087WW23
Residue:
218
  
Inhibitor
Name:
BDBM145796
Synonyms:
US8952177, 152 US9695149, 152
Type:
Small organic molecule
Emp. Form.:
C32H34F2N4O3
Mol. Mass.:
560.6342
SMILES:
Cc1ccc(COc2ccc3nc(C4CCCC[C@H]4C(O)=O)n(Cc4ccc(cc4)N4CCC(F)(F)C4)c3c2)nc1
: