Target
Tyrosine-protein kinase JAK3
Ligand
BDBM286095
Substrate
Meas. Tech.
In Vitro JAK Kinase Inhibition Test
IC50
1092±n/a nM
Citation
 Kim, JHChough, CYJeong, HULee, SMJoung, MSKim, SJKim, TWLee, SIYi, EJKim, KALee, JMYu, SMJo, YSMoon, HSKim, KR Substituted N-(pyrrolidine-3-yl)-7H-pyrrolo[2,3-D]pyrimidine-4-amine as janus kinase inhibitor US Patent  US10081635 Publication Date 9/25/2018 
Target
Name:
Tyrosine-protein kinase JAK3
Synonyms:
JAK-3 JAK3_HUMAN Janus kinase 3 (JAK3) L-JAK | Leukocyte janus kinase
Type:
Protein
Mol. Mass.:
125111.08
Organism:
Homo sapiens (Human)
Description:
P52333
Residue:
1124
  
Inhibitor
Name:
BDBM286095
Synonyms:
(R)-3-(7-(methyl(7H-pyrrolo[2,3-d]pyrimidin-4-yl)amino)-5-azaspiro[2.4]heptan-5-yl)-3-oxopropanenitrile | US10081635, Example 5
Type:
Small organic molecule
Emp. Form.:
C16H18N6O
Mol. Mass.:
310.3537
SMILES:
CN([C@H]1CN(CC11CC1)C(=O)CC#N)c1ncnc2[nH]ccc12
: