Target
Tyrosine-protein kinase JAK1
Ligand
BDBM286098
Substrate
Meas. Tech.
In Vitro JAK Kinase Inhibition Test
IC50
58.6±n/a nM
Citation
 Kim, JHChough, CYJeong, HULee, SMJoung, MSKim, SJKim, TWLee, SIYi, EJKim, KALee, JMYu, SMJo, YSMoon, HSKim, KR Substituted N-(pyrrolidine-3-yl)-7H-pyrrolo[2,3-D]pyrimidine-4-amine as janus kinase inhibitor US Patent  US10081635 Publication Date 9/25/2018 
Target
Name:
Tyrosine-protein kinase JAK1
Synonyms:
JAK-1 JAK1A JAK1_HUMAN Janus kinase 1 (JAK1) | Janus kinase 1 JAK1
Type:
Protein
Mol. Mass.:
133293.73
Organism:
Homo sapiens (Human)
Description:
P23458
Residue:
1154
  
Inhibitor
Name:
BDBM286098
Synonyms:
(R)-3-((7-(methyl(7H-pyrrolo[2,3-d]pyrimidin-4-yl)amino)-5-azaspiro[2.4]heptan-5-yl)sulfonyl)benzonitrile | US10081635, Example 41
Type:
Small organic molecule
Emp. Form.:
C20H20N6O2S
Mol. Mass.:
408.477
SMILES:
CN([C@H]1CN(CC11CC1)S(=O)(=O)c1cccc(c1)C#N)c1ncnc2[nH]ccc12
: