Target
Peroxisome proliferator-activated receptor gamma
Ligand
BDBM147216
Substrate
Meas. Tech.
Lanthascreen Competitive Binding Assay
IC50
0.5±n/a nM
Citation
 Kamenecka, TMGriffin, PRKoenig, MAsteian, ABlayo, AHe, YShin, Y N-biphenylmethylindole modulators of PPARG US Patent  US8957093 Publication Date 2/17/2015 
Target
Name:
Peroxisome proliferator-activated receptor gamma
Synonyms:
NR1C3 PPAR-gamma PPARG_HUMAN Peroxisome proliferator-activated receptor gamma (PPAR gamma) Peroxisome proliferator-activated receptor gamma (PPARĪ³) peroxisome proliferator-activated receptor gamma isoform 2
Type:
Nuclear Receptor
Mol. Mass.:
57613.46
Organism:
Homo sapiens (Human)
Description:
P37231
Residue:
505
  
Inhibitor
Name:
BDBM147216
Synonyms:
US8957093, 25
Type:
Small organic molecule
Emp. Form.:
C34H32N2O3
Mol. Mass.:
516.6295
SMILES:
Cc1c(C)c2cc(ccc2n1Cc1ccc(cc1)-c1ccccc1C(O)=O)C(=O)NC(C)(C)c1ccccc1
: