Target
Tyrosine-protein kinase JAK1
Ligand
BDBM147817
Substrate
Meas. Tech.
HTRF Assay
IC50
0.9±n/a nM
Citation
 Brubaker, JDinsmore, CHoffman, DMJung, JLiu, DPeterson, SSiu, TTorres, LEZhang, HWei, ZShi, F Cycloalkylnitrile pyrazole carboxamides as janus kinase inhibitors US Patent  US8962608 Publication Date 2/24/2015 
Target
Name:
Tyrosine-protein kinase JAK1
Synonyms:
JAK-1 JAK1A JAK1_HUMAN Janus kinase 1 (JAK1) | Janus kinase 1 JAK1
Type:
Protein
Mol. Mass.:
133293.73
Organism:
Homo sapiens (Human)
Description:
P23458
Residue:
1154
  
Inhibitor
Name:
BDBM147817
Synonyms:
US8962608, 28-137
Type:
Small organic molecule
Emp. Form.:
C21H23F3N6O
Mol. Mass.:
432.4421
SMILES:
NC(=O)c1cn(nc1Nc1ccc(cc1)C(F)(F)F)[C@H]1CC[C@@H](C[C@@H]1C#N)NC1CC1
: