Target
Tyrosine-protein kinase JAK1
Ligand
BDBM147878
Substrate
Meas. Tech.
HTRF Assay
IC50
0.75±n/a nM
Citation
 Brubaker, JDinsmore, CHoffman, DMJung, JLiu, DPeterson, SSiu, TTorres, LEZhang, HWei, ZShi, F Cycloalkylnitrile pyrazole carboxamides as janus kinase inhibitors US Patent  US8962608 Publication Date 2/24/2015 
Target
Name:
Tyrosine-protein kinase JAK1
Synonyms:
JAK-1 JAK1A JAK1_HUMAN Janus kinase 1 (JAK1) | Janus kinase 1 JAK1
Type:
Protein
Mol. Mass.:
133293.73
Organism:
Homo sapiens (Human)
Description:
P23458
Residue:
1154
  
Inhibitor
Name:
BDBM147878
Synonyms:
US8962608, 28-202
Type:
Small organic molecule
Emp. Form.:
C23H27F3N6O
Mol. Mass.:
460.4953
SMILES:
CC1(C)CN(C1)[C@H]1CC[C@@H]([C@H](C1)C#N)n1cc(C(N)=O)c(Nc2ccc(cc2)C(F)(F)F)n1
: