Target
Tyrosine-protein kinase JAK2
Ligand
BDBM147664
Substrate
Meas. Tech.
HTRF Assay
IC50
3±n/a nM
Citation
 Brubaker, JDinsmore, CHoffman, DMJung, JLiu, DPeterson, SSiu, TTorres, LEZhang, HWei, ZShi, F Cycloalkylnitrile pyrazole carboxamides as janus kinase inhibitors US Patent  US8962608 Publication Date 2/24/2015 
Target
Name:
Tyrosine-protein kinase JAK2
Synonyms:
JAK-2 JAK2_HUMAN Janus kinase 2 (JAK2) | Janus kinase 2 (a protein tyrosine kinase)
Type:
Protein
Mol. Mass.:
130684.68
Organism:
Homo sapiens (Human)
Description:
O60674
Residue:
1132
  
Inhibitor
Name:
BDBM147664
Synonyms:
US8962608, 25-28
Type:
Small organic molecule
Emp. Form.:
C18H21N5O4S
Mol. Mass.:
403.455
SMILES:
CS(=O)(=O)c1ccc(Nc2nn(cc2C(N)=O)[C@H]2CC[C@@H](O)C[C@@H]2C#N)cc1
: