Target
Inhibitor of nuclear factor kappa-B kinase subunit epsilon
Ligand
BDBM148133
Substrate
Meas. Tech.
Time-Resolved Fluorescence-based Lanthascreen Assay
pH
7.5±n/a
IC50
<30±n/a nM
Comments
extracted
Citation
 Perrior, TRNewton, GKStewart, MRAqil, R Pyrimidine compounds as inhibitors of protein kinases IKK epsilon and/or TBK-1, processes for their preparation, and pharmaceutical compositions containing them US Patent  US8962609 Publication Date 2/24/2015 
Target
Name:
Inhibitor of nuclear factor kappa-B kinase subunit epsilon
Synonyms:
I kappa-B kinase epsilon I-kappa-B kinase epsilon (IKK-E) IKBKE IKK-epsilon IKKE IKKI KIAA0151 | von Hippel-Lindau disease tumor suppressor/Inhibitor of nuclear factor kappa-B kinase subunit epsilon
Type:
Serine/threonine-protein kinase
Mol. Mass.:
80475.98
Organism:
Homo sapiens (Human)
Description:
Kinase inhibitory activity was determined using recombinant human IKK-epsilon expressed in baculovirus as a FLAG-tagged fusion protein.
Residue:
716
  
Inhibitor
Name:
BDBM148133
Synonyms:
US8962609, DMX-74
Type:
Small organic molecule
Emp. Form.:
C19H19N7O
Mol. Mass.:
361.4005
SMILES:
Cn1cc(Nc2nccc(n2)-c2ccc(N3CC[C@H](O)C3)c(c2)C#N)cn1
: