Target
Vasopressin V2 receptor
Ligand
BDBM192446
Substrate
Meas. Tech.
Cellular In Vitro Assay
Temperature
310.15±n/a K
IC50
32±n/a nM
Comments
extracted
Citation
 Fürstner, CKeldenich, JDelbeck, MKolkhof, PKretschmer, APluschkell, IPook, ESchmeck, CTrübel, H Bisaryl-bonded aryltriazolones and use thereof US Patent  US9687476 Publication Date 6/27/2017 
Target
Name:
Vasopressin V2 receptor
Synonyms:
ADHR AVPR2 DIR Renal-type arginine vasopressin receptor V2R_HUMAN Vasopressin V2 receptor | Vasopressin receptor
Type:
Receptor
Mol. Mass.:
40295.28
Organism:
Homo sapiens (Human)
Description:
P30518
Residue:
371
  
Inhibitor
Name:
BDBM192446
Synonyms:
US9187466, 17 | US9687476, 17
Type:
Small organic molecule
Emp. Form.:
C20H14Cl2F3N5O3
Mol. Mass.:
500.258
SMILES:
O[C@@H](Cn1c(nn(Cc2nnc(o2)-c2ccccc2Cl)c1=O)-c1ccc(Cl)cc1)C(F)(F)F
: