Target
Vasopressin V1a receptor
Ligand
BDBM192465
Substrate
Meas. Tech.
Cellular In Vitro Assay
Temperature
310.15±n/a K
IC50
89±n/a nM
Comments
extracted
Citation
 Fürstner, CKeldenich, JDelbeck, MKolkhof, PKretschmer, APluschkell, IPook, ESchmeck, CTrübel, H Bisaryl-bonded aryltriazolones and use thereof US Patent  US9687476 Publication Date 6/27/2017 
Target
Name:
Vasopressin V1a receptor
Synonyms:
AVPR V1a AVPR1A V1AR_HUMAN VASOPRESSIN V1A Vasopressin V1 receptor Vasopressin receptor
Type:
Receptor
Mol. Mass.:
46820.18
Organism:
Homo sapiens (Human)
Description:
P37288
Residue:
418
  
Inhibitor
Name:
BDBM192465
Synonyms:
US9187466, 93 | US9687476, 93
Type:
Small organic molecule
Emp. Form.:
C22H16Cl2F3N5O2
Mol. Mass.:
510.296
SMILES:
O[C@@H](Cn1c(nn(Cc2ccnc(n2)-c2ccccc2Cl)c1=O)-c1ccc(Cl)cc1)C(F)(F)F
: