Target
Tyrosine-protein kinase JAK2
Ligand
BDBM148398
Substrate
Meas. Tech.
TR-FRET Assay
IC50
9±n/a nM
Citation
 Mc Allister, AMurone, MSengupta, SShetty, SJ Bicyclic compounds and their uses as dual c-SRC/JAK inhibitors US Patent  US8962637 Publication Date 2/24/2015 
Target
Name:
Tyrosine-protein kinase JAK2
Synonyms:
JAK-2 JAK2_HUMAN Janus kinase 2 (JAK2) | Janus kinase 2 (a protein tyrosine kinase)
Type:
Protein
Mol. Mass.:
130684.68
Organism:
Homo sapiens (Human)
Description:
O60674
Residue:
1132
  
Inhibitor
Name:
BDBM148398
Synonyms:
US8962637, 123
Type:
Small organic molecule
Emp. Form.:
C30H36F3N7O
Mol. Mass.:
567.6483
SMILES:
CC(CC(=O)Nc1ccc(C)c(c1)N1CCc2nc(Nc3ccc(cc3)N3CCN(C)CC3)ncc2C1)C(F)(F)F
: