Target
Tyrosine-protein kinase JAK2
Ligand
BDBM148443
Substrate
Meas. Tech.
TR-FRET Assay
IC50
8.8±n/a nM
Citation
 Mc Allister, AMurone, MSengupta, SShetty, SJ Bicyclic compounds and their uses as dual c-SRC/JAK inhibitors US Patent  US8962637 Publication Date 2/24/2015 
Target
Name:
Tyrosine-protein kinase JAK2
Synonyms:
JAK-2 JAK2_HUMAN Janus kinase 2 (JAK2) | Janus kinase 2 (a protein tyrosine kinase)
Type:
Protein
Mol. Mass.:
130684.68
Organism:
Homo sapiens (Human)
Description:
O60674
Residue:
1132
  
Inhibitor
Name:
BDBM148443
Synonyms:
US8962637, 174
Type:
Small organic molecule
Emp. Form.:
C32H31ClF3N7O
Mol. Mass.:
622.083
SMILES:
CN1CCN(CC1)c1ccc(Nc2ncc3CN(CCc3n2)c2cc(NC(=O)c3cccc(c3)C(F)(F)F)ccc2Cl)cc1
: