Target
Tyrosine-protein kinase JAK2
Ligand
BDBM148446
Substrate
Meas. Tech.
TR-FRET Assay
IC50
10±n/a nM
Citation
 Mc Allister, AMurone, MSengupta, SShetty, SJ Bicyclic compounds and their uses as dual c-SRC/JAK inhibitors US Patent  US8962637 Publication Date 2/24/2015 
Target
Name:
Tyrosine-protein kinase JAK2
Synonyms:
JAK-2 JAK2_HUMAN Janus kinase 2 (JAK2) | Janus kinase 2 (a protein tyrosine kinase)
Type:
Protein
Mol. Mass.:
130684.68
Organism:
Homo sapiens (Human)
Description:
O60674
Residue:
1132
  
Inhibitor
Name:
BDBM148446
Synonyms:
US8962637, 177
Type:
Small organic molecule
Emp. Form.:
C29H23ClF4N6O2
Mol. Mass.:
598.979
SMILES:
CNC(=O)c1ccc(Nc2ncc3CN(CCc3n2)c2cc(NC(=O)c3cc(F)cc(c3)C(F)(F)F)ccc2Cl)cc1
: