Target
Proto-oncogene tyrosine-protein kinase Src
Ligand
BDBM148398
Substrate
Meas. Tech.
TR-FRET Assay
IC50
3±n/a nM
Citation
 Mc Allister, AMurone, MSengupta, SShetty, SJ Bicyclic compounds and their uses as dual c-SRC/JAK inhibitors US Patent  US8962637 Publication Date 2/24/2015 
Target
Name:
Proto-oncogene tyrosine-protein kinase Src
Synonyms:
Calmodulin/Proto-oncogene tyrosine-protein kinase Src Proto-oncogene c-Src SRC SRC_HUMAN V-src sarcoma (Schmidt-Ruppin A-2) viral oncogene homolog (avian) p60-Src | pp60c-src
Type:
Protein
Mol. Mass.:
59838.60
Organism:
Homo sapiens (Human)
Description:
P12931
Residue:
536
  
Inhibitor
Name:
BDBM148398
Synonyms:
US8962637, 123
Type:
Small organic molecule
Emp. Form.:
C30H36F3N7O
Mol. Mass.:
567.6483
SMILES:
CC(CC(=O)Nc1ccc(C)c(c1)N1CCc2nc(Nc3ccc(cc3)N3CCN(C)CC3)ncc2C1)C(F)(F)F
: