Target
Delta-type opioid receptor
Ligand
BDBM148977
Substrate
Meas. Tech.
Competitive Displacement Assay
pH
7.5±n/a
Temperature
298.15±n/a K
Ki
11±n/a nM
Comments
extracted
Citation
 Blumberg, LCArnelle, D Peripherally acting opioid compounds US Patent  US8962646 Publication Date 2/24/2015 
Target
Name:
Delta-type opioid receptor
Synonyms:
D-OR-1 Delta opioid receptor OPIATE Delta OPRD1 OPRK1 | opioid receptor, delta 1
Type:
G Protein-Coupled Receptor (GPCR)
Mol. Mass.:
40382.98
Organism:
Homo sapiens (Human)
Description:
Competition binding assays were carried out using membrane preparations from transfected HN9.10 cells that constitutively expressed the delta opioid receptor.
Residue:
372
  
Inhibitor
Name:
BDBM148977
Synonyms:
US10512644, Compound Morphine | US8962646, A
Type:
Small organic molecule
Emp. Form.:
C17H19NO3
Mol. Mass.:
285.3377
SMILES:
CN1CC[C@@]23[C@H]4Oc5c2c(CC1C3C=C[C@@H]4O)ccc5O
: