Target
Lymphokine-activated killer T-cell-originated protein kinase
Ligand
BDBM149029
Substrate
Meas. Tech.
Kinase Assay
pH
7.4±n/a
Temperature
298.15±n/a K
IC50
2.5±n/a nM
Comments
extracted
Citation
 Nakamura, YMatsuo, YHisada, SAhmed, FHuntley, RSajjadi-Hashemi, ZJenkins, DMKargbo, RBCui, WGauuan, PJWalker, JRDecornez, HGurram, M Tricyclic compounds and PBK inhibitors containing the same US Patent  US8962648 Publication Date 2/24/2015 
Target
Name:
Lymphokine-activated killer T-cell-originated protein kinase
Synonyms:
2.7.12.2 Cancer/testis antigen 84 Nori-3 PDZ-binding kinase Spermatogenesis-related protein kinase TOPK | TOPK_HUMAN
Type:
Mol. Mass.:
36072.55
Organism:
Homo sapiens (Human)
Description:
Residue:
322
  
Inhibitor
Name:
BDBM149029
Synonyms:
US8962648, 256
Type:
Small organic molecule
Emp. Form.:
C18H13FN2O2S
Mol. Mass.:
340.371
SMILES:
NCc1ccc(cc1)-c1c(O)cc(F)c2[nH]c(=O)c3sccc3c12
: