Target
Free fatty acid receptor 4
Ligand
BDBM286146
Substrate
Meas. Tech.
AlphaScreen SureFire Assay
Temperature
298.15±n/a K
EC50
820±n/a nM
Comments
extracted
Citation
 Shi, YCheng, PTWang, YWu, SCZhang, H Bicyclo [2.2.1] acid GPR120 modulators US Patent  US9518000 Publication Date 12/13/2016 
Target
Name:
Free fatty acid receptor 4
Synonyms:
FFAR4 G-protein coupled receptor 120 G-protein coupled receptor GT01 GPR120 O3FAR1 PGR4
Type:
PROTEIN
Mol. Mass.:
42256.91
Organism:
Homo sapiens (Human)
Description:
ChEMBL_1508994
Residue:
377
  
Inhibitor
Name:
BDBM286146
Synonyms:
4-(4-(3-benzoyl- benzyloxy) bicyclo[2.2.1] heptan-1-yl) butanoic acid | US9518000, Example 39
Type:
Small organic molecule
Emp. Form.:
C25H28O4
Mol. Mass.:
392.4874
SMILES:
OC(=O)CCCC12CCC(CC1)(C2)OCc1cccc(c1)C(=O)c1ccccc1
: