Target
Glutaminyl-peptide cyclotransferase
Ligand
BDBM149376
Substrate
Meas. Tech.
Spectrophotometric Assay
Temperature
303.15±n/a K
Ki
17.7±n/a nM
IC50
326±n/a nM
Comments
extracted
Citation
 Heiser, USommer, RGaertner, UHamann, AAlmstetter, MThormann, MTreml, ADemuth, HHoffman, T Inhibitors of glutaminyl cyclase US Patent  US8962860 Publication Date 2/24/2015 
Target
Name:
Glutaminyl-peptide cyclotransferase
Synonyms:
Glutaminyl Cyclase Glutaminyl-peptide cyclotransferase Glutaminyl-tRNA cyclotransferase QPCT | QPCT_HUMAN
Type:
Enzyme
Mol. Mass.:
40877.05
Organism:
Homo sapiens (Human)
Description:
Q16769
Residue:
361
  
Inhibitor
Name:
BDBM149376
Synonyms:
US8962860, 43
Type:
Small organic molecule
Emp. Form.:
C17H12F2N4OS
Mol. Mass.:
358.365
SMILES:
Cc1ccc(C2N(C(=O)NC2=S)c2ccc3[nH]cnc3c2)c(F)c1F
: