Target
Calcium/calmodulin-dependent protein kinase type II subunit delta
Ligand
BDBM149451
Substrate
Meas. Tech.
In Vitro Inhibition Assay
IC50
22±n/a nM
Citation
 Beauverger, PBegis, GBiscarrat, SDuclos, OMcCort, G 5 oxo-5,8-dihydropyrido[2,3-d]pyrimidine derivatives as CaMKII kinase inhibitors for treating cardiovascular diseases US Patent  US8975250 Publication Date 3/10/2015 
Target
Name:
Calcium/calmodulin-dependent protein kinase type II subunit delta
Synonyms:
CAMK2D CaM kinase II CaMK-II subunit delta Calcium/calmodulin-dependent protein kinase type II subunit delta (CAMK2D) KCC2D_HUMAN
Type:
Enzyme Catalytic Domain
Mol. Mass.:
56419.78
Organism:
Homo sapiens (Human)
Description:
Q13557
Residue:
499
  
Inhibitor
Name:
BDBM149451
Synonyms:
US8975250, 35
Type:
Small organic molecule
Emp. Form.:
C25H30F3N7O3
Mol. Mass.:
533.546
SMILES:
CCn1c(N)c(C(N)=O)c(=O)c2cnc(Nc3ccc(cc3OC)C3CCN(CCC(F)(F)F)CC3)nc12
: