Target
Neuraminidase
Ligand
BDBM4959
Substrate
BDBM4702
Meas. Tech.
Neuraminidase Inhibition Assay
IC50
7900±n/a nM
Citation
 Smith, PWSollis, SLHowes, PDCherry, PCStarkey, IDCobley, KNWeston, HScicinski, JMerritt, AWhittington, AWyatt, PTaylor, NGreen, DBethell, RMadar, SFenton, RJMorley, PJPateman, TBeresford, A Dihydropyrancarboxamides related to zanamivir: a new series of inhibitors of influenza virus sialidases. 1. Discovery, synthesis, biological activity, and structure-activity relationships of 4-guanidino- and 4-amino-4H-pyran-6-carboxamides. J Med Chem 41:787-97 (1998)  
Target
Name:
Neuraminidase
Synonyms:
Influenza B Virus Neuraminidase NRAM_INBVI | Neuraminidase B
Type:
Enzyme
Mol. Mass.:
51459.76
Organism:
Influenza B virus
Description:
Residue:
465
  
Inhibitor
Name:
BDBM4959
Synonyms:
(2R,3R,4S)-4-amino-3-acetamido-2-[(2-phenylethyl)(propan-2-yl)carbamoyl]-3,4-dihydro-2H-pyran-6-carboxylic acid | carboxamide deriv. 4ab
Type:
Small organic molecule
Emp. Form.:
C20H27N3O5
Mol. Mass.:
389.4455
SMILES:
[H][C@]1(OC(=C[C@H](N)[C@H]1NC(C)=O)C(O)=O)C(=O)N(CCc1ccccc1)C(C)C
:
Substrate
Name:
BDBM4702
Synonyms:
(2R,4S,5R,6R)-5-acetamido-4-hydroxy-2-[(4-methyl-2-oxo-2H-chromen-7-yl)oxy]-6-[(1R,2R)-1,2,3-trihydroxypropyl]oxane-2-carboxylic acid neuraminidase substrate
Type:
Small organic molecule
Emp. Form.:
C21H25NO11
Mol. Mass.:
467.4233
SMILES:
CC(=O)N[C@@H]1[C@@H](O)C[C@](Oc2ccc3c(C)cc(=O)oc3c2)(O[C@H]1[C@H](O)[C@H](O)CO)C(O)=O
: