Target
Hepatocyte growth factor receptor
Ligand
BDBM149703
Substrate
Meas. Tech.
Kinase Assay
pH
7±n/a
Temperature
298.15±n/a K
Kd
0.5±n/a nM
Comments
extracted
Citation
 Xi, NWu, YLiao, MFeng, Y Substituted pyrazolone compounds and methods of use US Patent  US8975282 Publication Date 3/10/2015 
Target
Name:
Hepatocyte growth factor receptor
Synonyms:
Hepatocyte growth factor receptor Hepatocyte growth factor receptor (c-MET) MET Met proto-oncogene (hepatocyte growth factor receptor) Tyrosine-protein kinase Met (c-Met) c-Met kinase
Type:
Protein
Mol. Mass.:
155559.73
Organism:
Homo sapiens (Human)
Description:
P08581
Residue:
1390
  
Inhibitor
Name:
BDBM149703
Synonyms:
US8975282, 11
Type:
Small organic molecule
Emp. Form.:
C27H24FN5O4
Mol. Mass.:
501.509
SMILES:
Cc1c(C(=O)Nc2ccc(Oc3ccnc(NC(=O)C4CC4)c3)c(F)c2)c(=O)n(-c2ccccc2)n1C
: