Target
Beta-secretase 1
Ligand
BDBM149924
Substrate
Meas. Tech.
Fluorescence Resonance Energy Transfer (FRET) Assay
Ki
82.5±n/a nM
IC50
126±n/a nM
Citation
 Munakata, RInoue, MTominaga, HYamasaki, SShina, YSamizu, KHamaguchi, HHong, L Chromane compounds US Patent  US8975415 Publication Date 3/10/2015 
Target
Name:
Beta-secretase 1
Synonyms:
ASP2 Aspartyl protease 2 BACE1 Beta-secretase (BACE) Beta-secretase 1 (BACE 1) Beta-secretase 1 (BACE1) Beta-site amyloid precursor protein cleaving enzyme 1 Memapsin-2 beta-Secretase (BACE-1) | beta-Secretase (BACE1)
Type:
Protein
Mol. Mass.:
55755.10
Organism:
Homo sapiens (Human)
Description:
P56817
Residue:
501
  
Inhibitor
Name:
BDBM149924
Synonyms:
US8975415, RP205 | US9242973, RP205
Type:
Small organic molecule
Emp. Form.:
C25H25N3O3
Mol. Mass.:
415.4843
SMILES:
CC#Cc1cncc(c1)-c1ccc2OC(CC3CC3)C3(COC3)C3(COC(N)=N3)c2c1
: