Target
Beta-secretase 1
Ligand
BDBM149784
Substrate
Meas. Tech.
Time Resolved Fluorescence Resonance Energy Transfer (TR-FRET) Assay
IC50
388±n/a nM
Citation
 Munakata, RInoue, MTominaga, HYamasaki, SShina, YSamizu, KHamaguchi, HHong, L Chromane compounds US Patent  US8975415 Publication Date 3/10/2015 
Target
Name:
Beta-secretase 1
Synonyms:
ASP2 Aspartyl protease 2 BACE1 Beta-secretase (BACE) Beta-secretase 1 (BACE 1) Beta-secretase 1 (BACE1) Beta-site amyloid precursor protein cleaving enzyme 1 Memapsin-2 beta-Secretase (BACE-1) | beta-Secretase (BACE1)
Type:
Protein
Mol. Mass.:
55755.10
Organism:
Homo sapiens (Human)
Description:
P56817
Residue:
501
  
Inhibitor
Name:
BDBM149784
Synonyms:
US8975415, RP65 | US9242973, RP65
Type:
Small organic molecule
Emp. Form.:
C21H23N3O4
Mol. Mass.:
381.425
SMILES:
COc1ccnc(c1)-c1ccc2OC(C)(C)C3(COC3)C3(COC(N)=N3)c2c1
: