Target
Bromodomain-containing protein 4
Ligand
BDBM150051
Substrate
Meas. Tech.
TR-FRET In-Vitro Binding Assay
pH
7.5±n/a
Temperature
303.15±n/a K
IC50
17±n/a nM
Comments
extracted
Citation
 Bordas, VCotesta, SGuagnano, VRueeger, HVaupel, A Pyrazolopyrrolidine derivatives and their use in the treatment of disease US Patent  US8975417 Publication Date 3/10/2015 
Target
Name:
Bromodomain-containing protein 4
Synonyms:
BRD4 Bromodomain-containing protein 4 (BRD4) Protein HUNK1
Type:
Protein
Mol. Mass.:
152264.84
Organism:
Homo sapiens (Human)
Description:
O60885
Residue:
1362
  
Inhibitor
Name:
BDBM150051
Synonyms:
US8975417, 111
Type:
Small organic molecule
Emp. Form.:
C25H21ClN8O2
Mol. Mass.:
500.94
SMILES:
COc1ncccc1-n1nc(C)c2C(N(C(=O)c12)c1cc(C)c2nnc(C)n2n1)c1ccc(Cl)cc1
: