Target
Bromodomain-containing protein 4
Ligand
BDBM150122
Substrate
Meas. Tech.
TR-FRET In-Vitro Binding Assay
pH
7.5±n/a
Temperature
303.15±n/a K
IC50
22±n/a nM
Comments
extracted
Citation
 Bordas, VCotesta, SGuagnano, VRueeger, HVaupel, A Pyrazolopyrrolidine derivatives and their use in the treatment of disease US Patent  US8975417 Publication Date 3/10/2015 
Target
Name:
Bromodomain-containing protein 4
Synonyms:
BRD4 Bromodomain-containing protein 4 (BRD4) Protein HUNK1
Type:
Protein
Mol. Mass.:
152264.84
Organism:
Homo sapiens (Human)
Description:
O60885
Residue:
1362
  
Inhibitor
Name:
BDBM150122
Synonyms:
US8975417, 190
Type:
Small organic molecule
Emp. Form.:
C23H20ClFN6O
Mol. Mass.:
450.896
SMILES:
Cc1nn(C2CC2)c2C(=O)N([C@@H](c12)c1ccc(Cl)cc1F)c1cc(C)c2nnc(C)n2c1
: