Target
Bromodomain-containing protein 2
Ligand
BDBM149979
Substrate
Meas. Tech.
TR-FRET In-Vitro Binding Assay
pH
7.5±n/a
Temperature
303.15±n/a K
IC50
140±n/a nM
Comments
extracted
Citation
 Bordas, VCotesta, SGuagnano, VRueeger, HVaupel, A Pyrazolopyrrolidine derivatives and their use in the treatment of disease US Patent  US8975417 Publication Date 3/10/2015 
Target
Name:
Bromodomain-containing protein 2
Synonyms:
BRD2 Bromodomain and extra-terminal motif (BET) Bromodomain-containing protein 2 (BRD2) RING3
Type:
Protein
Mol. Mass.:
88085.95
Organism:
Homo sapiens (Human)
Description:
P25440
Residue:
801
  
Inhibitor
Name:
BDBM149979
Synonyms:
US8975417, 35
Type:
Small organic molecule
Emp. Form.:
C20H16Cl2N4O2
Mol. Mass.:
415.273
SMILES:
Cn1cc(cc(Cl)c1=O)N1C(c2cnn(C3CC3)c2C1=O)c1ccc(Cl)cc1
: