Target
Bromodomain-containing protein 2
Ligand
BDBM150082
Substrate
Meas. Tech.
TR-FRET In-Vitro Binding Assay
pH
7.5±n/a
Temperature
303.15±n/a K
IC50
180±n/a nM
Comments
extracted
Citation
 Bordas, VCotesta, SGuagnano, VRueeger, HVaupel, A Pyrazolopyrrolidine derivatives and their use in the treatment of disease US Patent  US8975417 Publication Date 3/10/2015 
Target
Name:
Bromodomain-containing protein 2
Synonyms:
BRD2 Bromodomain and extra-terminal motif (BET) Bromodomain-containing protein 2 (BRD2) RING3
Type:
Protein
Mol. Mass.:
88085.95
Organism:
Homo sapiens (Human)
Description:
P25440
Residue:
801
  
Inhibitor
Name:
BDBM150082
Synonyms:
US8975417, 142
Type:
Small organic molecule
Emp. Form.:
C22H22ClN5O3
Mol. Mass.:
439.895
SMILES:
CN(C)C(=O)n1nc(C)c2C(N(C(=O)c12)c1cc(C)c(=O)n(C)c1)c1ccc(Cl)cc1
: