Target
Bromodomain-containing protein 2
Ligand
BDBM150087
Substrate
Meas. Tech.
TR-FRET In-Vitro Binding Assay
pH
7.5±n/a
Temperature
303.15±n/a K
IC50
140±n/a nM
Comments
extracted
Citation
 Bordas, VCotesta, SGuagnano, VRueeger, HVaupel, A Pyrazolopyrrolidine derivatives and their use in the treatment of disease US Patent  US8975417 Publication Date 3/10/2015 
Target
Name:
Bromodomain-containing protein 2
Synonyms:
BRD2 Bromodomain and extra-terminal motif (BET) Bromodomain-containing protein 2 (BRD2) RING3
Type:
Protein
Mol. Mass.:
88085.95
Organism:
Homo sapiens (Human)
Description:
P25440
Residue:
801
  
Inhibitor
Name:
BDBM150087
Synonyms:
US8975417, 147
Type:
Small organic molecule
Emp. Form.:
C23H24ClN5O3
Mol. Mass.:
453.921
SMILES:
CCc1nn(C(=O)N(C)C)c2C(=O)N(C(c12)c1ccc(Cl)cc1)c1cc(C)c(=O)n(C)c1
: