Target
Bromodomain-containing protein 2
Ligand
BDBM150133
Substrate
Meas. Tech.
TR-FRET In-Vitro Binding Assay
pH
7.5±n/a
Temperature
303.15±n/a K
IC50
16±n/a nM
Comments
extracted
Citation
 Bordas, VCotesta, SGuagnano, VRueeger, HVaupel, A Pyrazolopyrrolidine derivatives and their use in the treatment of disease US Patent  US8975417 Publication Date 3/10/2015 
Target
Name:
Bromodomain-containing protein 2
Synonyms:
BRD2 Bromodomain and extra-terminal motif (BET) Bromodomain-containing protein 2 (BRD2) RING3
Type:
Protein
Mol. Mass.:
88085.95
Organism:
Homo sapiens (Human)
Description:
P25440
Residue:
801
  
Inhibitor
Name:
BDBM150133
Synonyms:
US8975417, 166
Type:
Small organic molecule
Emp. Form.:
C23H21ClN6O2
Mol. Mass.:
448.905
SMILES:
Cc1nnc2c(C)cc(cn12)N1[C@@H](c2c(CO)nn(C3CC3)c2C1=O)c1ccc(Cl)cc1
: