Target
Bromodomain-containing protein 3
Ligand
BDBM149963
Substrate
Meas. Tech.
TR-FRET In-Vitro Binding Assay
pH
7.5±n/a
Temperature
303.15±n/a K
IC50
65±n/a nM
Comments
extracted
Citation
 Bordas, VCotesta, SGuagnano, VRueeger, HVaupel, A Pyrazolopyrrolidine derivatives and their use in the treatment of disease US Patent  US8975417 Publication Date 3/10/2015 
Target
Name:
Bromodomain-containing protein 3
Synonyms:
BRD3 Bromodomain and extra-terminal motif (BET) Bromodomain-containing protein 3 (BRD3) RING3-like protein | RING3L
Type:
Protein
Mol. Mass.:
79571.81
Organism:
Homo sapiens (Human)
Description:
Q15059
Residue:
726
  
Inhibitor
Name:
BDBM149963
Synonyms:
US8975417, 19
Type:
Small organic molecule
Emp. Form.:
C21H18Cl2N4O2
Mol. Mass.:
429.299
SMILES:
Cc1c2[C@H](N(C(=O)c2nn1C1CC1)c1cc(Cl)c(=O)n(C)c1)c1ccc(Cl)cc1
: