Target
Bromodomain-containing protein 3
Ligand
BDBM150076
Substrate
Meas. Tech.
TR-FRET In-Vitro Binding Assay
pH
7.5±n/a
Temperature
303.15±n/a K
IC50
130±n/a nM
Comments
extracted
Citation
 Bordas, VCotesta, SGuagnano, VRueeger, HVaupel, A Pyrazolopyrrolidine derivatives and their use in the treatment of disease US Patent  US8975417 Publication Date 3/10/2015 
Target
Name:
Bromodomain-containing protein 3
Synonyms:
BRD3 Bromodomain and extra-terminal motif (BET) Bromodomain-containing protein 3 (BRD3) RING3-like protein | RING3L
Type:
Protein
Mol. Mass.:
79571.81
Organism:
Homo sapiens (Human)
Description:
Q15059
Residue:
726
  
Inhibitor
Name:
BDBM150076
Synonyms:
US8975417, 136
Type:
Small organic molecule
Emp. Form.:
C23H21ClN6O2
Mol. Mass.:
448.905
SMILES:
Cc1nnc2c(C)cc(cn12)N1C(c2c(C)n(nc2C1=O)C1COC1)c1ccc(Cl)cc1
: