Target
CREB-binding protein
Ligand
BDBM149986
Substrate
Meas. Tech.
AlphaScreen In-Vitro Binding Assay
pH
7.5±n/a
Temperature
303.15±n/a K
IC50
450±n/a nM
Comments
extracted
Citation
 Bordas, VCotesta, SGuagnano, VRueeger, HVaupel, A Pyrazolopyrrolidine derivatives and their use in the treatment of disease US Patent  US8975417 Publication Date 3/10/2015 
Target
Name:
CREB-binding protein
Synonyms:
CBP CREB-binding protein (CBP) CREBBP
Type:
Transcription Coactivator
Mol. Mass.:
265411.66
Organism:
Homo sapiens (Human)
Description:
Q92793
Residue:
2442
  
Inhibitor
Name:
BDBM149986
Synonyms:
US8975417, 42
Type:
Small organic molecule
Emp. Form.:
C20H18Cl2N4O2
Mol. Mass.:
417.289
SMILES:
CC(C)n1cc2C(N(C(=O)c2n1)c1cc(Cl)c(=O)n(C)c1)c1ccc(Cl)cc1
: