Target
Uncharacterized protein
Ligand
BDBM50446175
Substrate
Meas. Tech.
Luminescent Kinase Assay
IC50
7.00±n/a nM
Citation
 Fan, EVan Voorhis, WCZhang, ZHuang, WOjo, KK 5-aminopyrazole-4-carboxamide inhibitors of CDPK1 from T. gondii and C. parvum US Patent  US9518026 Publication Date 12/13/2016 
Target
Name:
Uncharacterized protein
Synonyms:
Calmodulin-domain protein kinase (CDPK1)
Type:
Enzyme Catalytic Domain
Mol. Mass.:
60946.72
Organism:
Cryptosporidium parvum
Description:
Residue:
538
  
Inhibitor
Name:
BDBM50446175
Synonyms:
CHEMBL3108986 US9956214, Compound 13
Type:
Small organic molecule
Emp. Form.:
C17H18N4O
Mol. Mass.:
294.351
SMILES:
CC(C)n1nc(c(C(N)=O)c1N)-c1ccc2ccccc2c1
: