Target
Uncharacterized protein
Ligand
BDBM50446166
Substrate
Meas. Tech.
Luminescent Kinase Assay
IC50
16.0±n/a nM
Citation
 Fan, EVan Voorhis, WCZhang, ZHuang, WOjo, KK 5-aminopyrazole-4-carboxamide inhibitors of CDPK1 from T. gondii and C. parvum US Patent  US9518026 Publication Date 12/13/2016 
Target
Name:
Uncharacterized protein
Synonyms:
Calmodulin-domain protein kinase (CDPK1)
Type:
Enzyme Catalytic Domain
Mol. Mass.:
60946.72
Organism:
Cryptosporidium parvum
Description:
Residue:
538
  
Inhibitor
Name:
BDBM50446166
Synonyms:
CHEMBL3108990 US9956214, Compound 17
Type:
Small organic molecule
Emp. Form.:
C20H22N4O
Mol. Mass.:
334.4149
SMILES:
NC(=O)c1c(N)n(nc1-c1ccc2ccccc2c1)C1CCCCC1
: