Target
Calmodulin-domain protein kinase 1
Ligand
BDBM50446161
Substrate
Meas. Tech.
Luminescent Kinase Assay
IC50
32.0±n/a nM
Citation
 Fan, EVan Voorhis, WCZhang, ZHuang, WOjo, KK 5-aminopyrazole-4-carboxamide inhibitors of CDPK1 from T. gondii and C. parvum US Patent  US9518026 Publication Date 12/13/2016 
Target
Name:
Calmodulin-domain protein kinase 1
Synonyms:
Calmodulin-domain protein kinase 1 Calmodulin-domain protein kinase, putative
Type:
Enzyme Catalytic Domain
Mol. Mass.:
57248.42
Organism:
Toxoplasma gondii
Description:
Residue:
507
  
Inhibitor
Name:
BDBM50446161
Synonyms:
CHEMBL3109003 US9956214, Compound 30
Type:
Small organic molecule
Emp. Form.:
C16H20N6O
Mol. Mass.:
312.3696
SMILES:
Cn1ncc2cc(ccc12)-c1nn(c(N)c1C(N)=O)C(C)(C)C
: