Target
Calmodulin-domain protein kinase 1
Ligand
BDBM50148631
Substrate
Meas. Tech.
Luminescent Kinase Assay
IC50
8.00±n/a nM
Citation
 Fan, EVan Voorhis, WCZhang, ZHuang, WOjo, KK 5-aminopyrazole-4-carboxamide inhibitors of CDPK1 from T. gondii and C. parvum US Patent  US9518026 Publication Date 12/13/2016 
Target
Name:
Calmodulin-domain protein kinase 1
Synonyms:
Calmodulin-domain protein kinase 1 Calmodulin-domain protein kinase, putative
Type:
Enzyme Catalytic Domain
Mol. Mass.:
57248.42
Organism:
Toxoplasma gondii
Description:
Residue:
507
  
Inhibitor
Name:
BDBM50148631
Synonyms:
CHEMBL3769918 US9956214, Compound 1573
Type:
Small organic molecule
Emp. Form.:
C19H23N5O2
Mol. Mass.:
353.4182
SMILES:
CCOc1ccc2cc(cnc2c1)-c1nn(CC(C)C)c(N)c1C(N)=O
: