Target
Calmodulin-domain protein kinase 1
Ligand
BDBM286284
Substrate
Meas. Tech.
Luminescent Kinase Assay
IC50
7.00±n/a nM
Citation
 Fan, EVan Voorhis, WCZhang, ZHuang, WOjo, KK 5-aminopyrazole-4-carboxamide inhibitors of CDPK1 from T. gondii and C. parvum US Patent  US9518026 Publication Date 12/13/2016 
Target
Name:
Calmodulin-domain protein kinase 1
Synonyms:
Calmodulin-domain protein kinase 1 Calmodulin-domain protein kinase, putative
Type:
Enzyme Catalytic Domain
Mol. Mass.:
57248.42
Organism:
Toxoplasma gondii
Description:
Residue:
507
  
Inhibitor
Name:
BDBM286284
Synonyms:
US9518026, Example 77 | US9956214, Compound 1653
Type:
Small organic molecule
Emp. Form.:
C22H25N5O2
Mol. Mass.:
391.4662
SMILES:
NC(=O)c1c(N)n(nc1-c1ccc2nc(OC3CCC3)ccc2c1)C1CCCC1
: