Target
Uncharacterized protein
Ligand
BDBM50200560
Substrate
Meas. Tech.
Luminescent Kinase Assay
IC50
6.00±n/a nM
Citation
 Fan, EVan Voorhis, WCZhang, ZHuang, WOjo, KK 5-aminopyrazole-4-carboxamide inhibitors of CDPK1 from T. gondii and C. parvum US Patent  US9518026 Publication Date 12/13/2016 
Target
Name:
Uncharacterized protein
Synonyms:
Calmodulin-domain protein kinase (CDPK1)
Type:
Enzyme Catalytic Domain
Mol. Mass.:
60946.72
Organism:
Cryptosporidium parvum
Description:
Residue:
538
  
Inhibitor
Name:
BDBM50200560
Synonyms:
CHEMBL3922900 US9956214, Compound 1612
Type:
Small organic molecule
Emp. Form.:
C19H21N5O3
Mol. Mass.:
367.4017
SMILES:
CCOc1ccc2cc(cnc2c1)-c1nn(C2CCOC2)c(N)c1C(N)=O
: