Target
Coagulation factor IX
Ligand
BDBM150231
Substrate
Meas. Tech.
Inhibition Assay
pH
8±n/a
Temperature
298.15±n/a K
IC50
54±0.0 nM
Comments
extracted
Citation
 Voss, MSone, HChackalamannil, SOhkouchi, M Factor IXa inhibitors US Patent  US8980916 Publication Date 3/17/2015 
Target
Name:
Coagulation factor IX
Synonyms:
Christmas factor Coagulation factor IX/VIII Coagulation factor IXa heavy chain F9 Factor IX Factor IXa (fIXa) Plasma thromboplastin component
Type:
Enzyme
Mol. Mass.:
51768.83
Organism:
Homo sapiens (Human)
Description:
P00740
Residue:
461
  
Inhibitor
Name:
BDBM150231
Synonyms:
US8980916, 6
Type:
Small organic molecule
Emp. Form.:
C26H26N4O3
Mol. Mass.:
442.5096
SMILES:
CC(C)(C)c1ccc(cc1)-n1cccc(C(O)C(=O)Nc2ccc3c(N)nccc3c2)c1=O
: