Target
Dipeptidyl peptidase 4
Ligand
BDBM150240
Substrate
Meas. Tech.
Fluorometric Assay
pH
7.5±n/a
IC50
12.6±n/a nM
Comments
extracted
Citation
 Hicks, JDBiftu, TChen, PQian, XWilkening, RR Substituted seven-membered heterocyclic compounds as dipeptidyl peptidase-iv inhibitors for the treatment of diabetes US Patent  US8980929 Publication Date 3/17/2015 
Target
Name:
Dipeptidyl peptidase 4
Synonyms:
ADABP Adenosine deaminase complexing protein 2 CD_antigen=CD26 DPP4 DPPIV Dipeptidyl peptidase 4 (DPP IV) Dipeptidyl peptidase 4 (DPP4) Dipeptidyl peptidase 4 membrane form Dipeptidyl peptidase IV Dipeptidyl peptidase IV (DDP-IV) Dipeptidyl peptidase IV membrane form Dipeptidyl peptidase-IV (DPP-4) T-cell activation antigen CD26 | TP103
Type:
Enzyme
Mol. Mass.:
88271.01
Organism:
Homo sapiens (Human)
Description:
P27487
Residue:
766
  
Inhibitor
Name:
BDBM150240
Synonyms:
US8980929, Example Compound 14 | US8980929, Example Compound 8
Type:
Small organic molecule
Emp. Form.:
C21H25F3N4O3S
Mol. Mass.:
470.508
SMILES:
CC1(CC1)S(=O)(=O)n1cc2CN(Cc2n1)[C@H]1CCO[C@@H]([C@@H](N)C1)c1cc(F)c(F)cc1F
: