Target
Transcription factor p65
Ligand
BDBM150265
Substrate
Meas. Tech.
Inhibition Assay
IC50
600±n/a nM
Citation
 Vander Jagt, DLDeck, LM Substituted cis- and trans-stilbenes as therapeutic agents US Patent  US8980954 Publication Date 3/17/2015 
Target
Name:
Transcription factor p65
Synonyms:
NFKB3 Nuclear factor NF-kappa-B p65 subunit TF65_HUMAN | v-rel reticuloendotheliosis viral oncogene homolog A isoform 1
Type:
Enzyme
Mol. Mass.:
60211.92
Organism:
Homo sapiens (Human)
Description:
Q04206
Residue:
551
  
Inhibitor
Name:
BDBM150265
Synonyms:
US8980954, 6r
Type:
Small organic molecule
Emp. Form.:
C16H16O2
Mol. Mass.:
240.297
SMILES:
COc1ccc(\C=C\c2cccc(OC)c2)cc1
: