Target
Progesterone receptor
Ligand
BDBM150276
Substrate
Meas. Tech.
Binding Assay
IC50
15±n/a nM
Citation
 Klar, UKuhnke, JBohlmann, RHübner, JRing, SFrenzel, TMenges, FBorden, SMuhn, HPrelle, K 19-nor-steroid derivatives with a 15α,16α-methylene group and a saturated 17,17-spirolactone ring, use thereof, and medicaments containing said derivatives US Patent  US8987239 Publication Date 3/24/2015 
Target
Name:
Progesterone receptor
Synonyms:
NR3C3 PGR PRGR_HUMAN | progesterone
Type:
Protein
Mol. Mass.:
98979.52
Organism:
Homo sapiens (Human)
Description:
P06401
Residue:
933
  
Inhibitor
Name:
BDBM150276
Synonyms:
US8987239, 1
Type:
Small organic molecule
Emp. Form.:
C22H28O3
Mol. Mass.:
340.4559
SMILES:
C[C@]12CCC3C(CCC4=CC(=O)CCC34)C1C1CC1[C@@]21CCC(=O)O1
: